{"text_format":"1","workbook":"xlsx","n_sheets":4,"sheets":["Elolap","Tamogatastartalom","Szamitasok","Adatok"],"not_rendered":{"charts":0,"images":0,"macros":1,"external_links":0,"defined_names":59,"comments":1,"pivot_tables":0},"unopened":[],"bounds":{"document_bytes":16777216,"sheet_cells":100000,"rows_first":2000,"rows_last":500,"rows_between":2000,"halvings":0,"cell_chars":16384,"cell_head_chars":4096},"cells_cut":0,"cells_raw":0,"read":"whole","date_system":"1900"}

{"sheet":"Elolap","index":0,"n_rows":0,"n_cols":0,"rows_kept":0,"cut":false,"hidden":false,"merged":[]}

{"sheet":"Tamogatastartalom","index":1,"n_rows":134,"n_cols":50,"rows_kept":134,"cut":false,"hidden":false,"merged":[[10,6,12,6],[0,22,1,23],[0,14,1,15],[3,1,3,2],[5,1,5,2],[7,6,9,6],[2,49,3,49],[3,5,4,5],[2,22,3,22],[2,23,3,23],[2,46,2,47],[2,42,2,44],[2,24,2,27],[2,29,2,33],[2,39,2,41],[2,14,3,14],[2,15,3,15]]}
[null,null,null,null,null,null,null,null,null,null,null,null,null,null,{"$f":"IF(SUM(P7:P134)<C24,\"A folyósítások összege kevesebb, mint a hitelösszeg\",\"A folyósítások összege több, mint a hitelösszeg\")","v":"A folyósítások összege több, mint a hitelösszeg"},null,null,null,null,null,null,null,{"$f":"IF(SUM(X7:X134)<C24,\"A törlesztések összege kevesebb, mint a hitelösszeg\",\"A törlesztések összege több, mint a hitelösszeg\")","v":"A törlesztések összege több, mint a hitelösszeg"}]
[]
[null,"Ügyfél neve: ",null,null,null,null,null,null,"EUR","HUF",null,null,null,null,"Egyedi folyósítás dátuma","Folyósítás összege",null,null,null,null,null,null,"Egyedi törlesztés dátuma","Tőkeamortizáció egyedi törlesztés esetén","periódusközi kamatszámítás",null,null,null,null,"maradék kamatszámítás",null,null,null,null,null,null,null,null,null,"Piaci konstrukció",null,null,"Támogatott konstruckió",null,null,null,"Támogatástartalom",null,null,"Támogatástartalom + egyéb kedvezmények"]
[null,null,null,null,-0.04,null,"Hitelösszeg",null,{"$f":"IF(C9=\"HUF\",C24/C10,C24)","v":0},{"$f":"IF(C9=\"HUF\",C24,C24*arfolyam)","v":0},null,null,null,null,null,null,null,null,"kamat","támogatott",null,null,null,null,"dátumtól","tőke","kamat","támogatott",null,"dátumtól","amort","tőke","maradék","t maradék",null,null,null,"Periodus","Dátum","Tőke","Tőkeamt.","Kamatfiz.","Tőke","Tőkeamt.","Kamatfiz.",null,"FV","PV"]
[null,"Pénzügyi intézmény neve refinanszírozás esetén: ",null,null,{"$f":"IF(C22=\"Halászati\",K10,IF(C22=\"Mezőgazdasági\",K9,K8))","v":2250000},null,"Ténylegesen felvett hitel támogatástartalma 2.1",null,{"$f":"IF(C9=\"HUF\",AU5/C10,AU5)","v":0},{"$f":"IF(C9=\"HUF\",AU5,AU5*C10)","v":0},{"$f":"IFERROR(IF(E5-I5<=0,\"Nem elegendő a 2.1 szabad keret\",IF(C30>C17,\"Az Ideiglenes Válság- és Átállási Közlemény 2.1 szakasz alapján önállóan nyújtott kamattámogatás esetén a Kölcsön Kamatlábnak minden esetben legalább 1 bázispont (0,01% p.a.) támogatástartalommal kell rendelkeznie.\",\"\")),\"\")","v":""},null,null,null,null,null,null,null,{"$f":"SUM(S7:S134)","v":0},{"$f":"SUM(T7:T134)","v":0},null,null,null,null,null,null,{"$f":"SUM(AA7:AA134)","v":0},{"$f":"SUM(AB7:AB134)","v":0},null,null,null,null,{"$f":"SUM(AG7:AG134)","v":0},{"$f":"SUM(AH7:AH134)","v":0},null,null,null,null,null,{"$f":"+AN7","v":0},{"$f":"SUM(AO7:AO134)","v":0},{"$f":"SUM(AP7:AP134)","v":0},{"$f":"+AQ7","v":0},{"$f":"SUM(AR7:AR134)","v":0},{"$f":"SUM(AS7:AS134)","v":0},null,{"$f":"SUM(AU7:AU134)","v":0},{"$f":"SUM(AV7:AV134)","v":0},null,{"$f":"AV5","v":0}]
[null,null,null,null,{"$f":"IF(C22=\"Halászati\",K13,IF(C22=\"Mezőgazdasági\",K12,K11))","v":2300000},null,null,null,null,null,null,null,"Törlesztésiidőszak vége?",null,null,null,null,null,null,null,null,null,null,null,null,null,null,null,null,null,null,null,null,null,null,null,null,0,{"$f":"MAX(C27,MIN(O7:O134))","v":"00:00:00"}]
[null,null,null,null,null,null,null,null,null,null,null,null,{"$f":"AL7>$E$15","v":true},null,null,null,{"$f":"C27","v":"00:00:00"},{"$f":"IF(ISBLANK(O7),C24,0)","v":0},{"$f":"IF(AND(ISBLANK(O6),AK7<>1),0,IFERROR(-R7*piacikamat/365*(IF(ISBLANK(O7),$C$28,O7)-Q7),\"\"))","v":""},{"$f":"IF(AND(ISBLANK(O6),AK7<>1),0,IFERROR(-R7*tenylegeskamat/365*(IF(ISBLANK(O7),$C$28,O7)-Q7),\"\"))","v":0},{"$f":"IFERROR(IF(ISBLANK(O7),$C$28,O7)-Q7,\"\")","v":0},null,null,null,{"$f":"IF(ISNA(MAX(W6,INDEX(AM$6:AM$134,MATCH(W7-1,AM$6:AM$134,1)))),\"\",MAX(W6,INDEX(AM$6:AM$134,MATCH(W7-1,AM$6:AM$134,1))))","v":""},{"$f":"IF(ISNA(MIN(IF(OR(ISBLANK(Z6),Z6=\"\"),INDEX(AN$7:AN$134,MATCH(W7,AM$7:AM$134,1)),Z6-X6),INDEX(AN$7:AN$134,MATCH(W7,AM$7:AM$134,1)))),\"\",MIN(IF(OR(ISBLANK(Z6),Z6=\"\"),INDEX(AN$7:AN$134,MATCH(W7,AM$7:AM$134,1)),Z6-X6),INDEX(AN$7:AN$134,MATCH(W7,AM$7:AM$134,1))))","v":0},{"$f":"IFERROR(-Z7*piacikamat/365*(W7-Y7),\"\")","v":""},{"$f":"IFERROR(-Z7*tenylegeskamat/365*(W7-Y7),\"\")","v":""},{"$f":"IFERROR(W7-Y7,\"\")","v":""},{"$f":"MAX(AM6,IF(ISNA(INDEX(W$7:W$134,MATCH(AM7,W$7:W$134,1))),0,INDEX(W$7:W$134,MATCH(AM7,W$7:W$134,1))))","v":"00:00:00"},{"$f":"IF(ISNA(INDEX(X$7:X$134,MATCH(AM7,W$7:W$134,1))),0,INDEX(X$7:X$134,MATCH(AM7,W$7:W$134,1)))","v":0},{"$f":"IF(ISNA(INDEX(Z$7:Z$134,MATCH(AM7,W$7:W$134,1))),AN7,INDEX(Z$7:Z$134,MATCH(AM7,W$7:W$134,1)))","v":0},{"$f":"IFERROR(-(AF7-AE7)*piacikamat/365*(AM7-AD7),0)","v":0},{"$f":"IFERROR(-(AF7-AE7)*tenylegeskamat/365*(AM7-AD7),0)","v":0},{"$f":"IFERROR(AM7-AD7,\"\")","v":0},null,1,{"$f":"+IF(C29-C28<>0,1,\"\")","v":""},{"$f":"C28","v":"00:00:00"},{"$f":"IF(+C24<>0,C24,IF(AL7>0,C24*M7,\"\"))","v":0},{"$f":"IF(torlesztes=\"Egyedi\",-SUMIFS(X$7:X$134,W$7:W$134,\">\"&AM6,W$7:W$134,\"<=\"&AM7),IFERROR(IF(torlesztes=\"Egyenlő tőke\",IF(COUNT($AN$7:AN7)>$E$15,\"\",-$AN$5/$E$15),0),\"\"))","v":0},{"$f":"SUM(S7:S134)","v":0},{"$f":"+AN7","v":0},{"$f":"IF(torlesztes=\"Egyedi\",-SUMIFS(X$7:X$134,W$7:W$134,\">\"&AM6,W$7:W$134,\"<=\"&AM7),IFERROR(IF(torlesztes=\"Egyenlő tőke\",IF(COUNT($AQ$7:AQ7)>$E$15,\"\",-$AN$5/$E$15),0),\"\"))","v":0},{"$f":"SUM(T7:T134)","v":0},null,{"$f":"IFERROR(MAX((ABS(AP7)-ABS(AS7)),0),\"\")","v":0},{"$f":"IFERROR(AU7/(1+($C$11+1%)/365*(AM7-C26)),\"\")","v":0},{"$f":"IFERROR(AM7-AM6,\"\")","v":0}]
[null,"PIACI KAMAT MEGHATÁROZÁSA",null,null,null,null,"Válságkezelési közlemény 2.1 alapján megítélt támogatásokon felül igénybe vehető szabad keret (EUR)","Általános szabály",null,null,{"$f":"IF(2250000-C40-C41-C42-C45-C46-C47-C51-C52-C53<=0,\"Nincs szabad keret, nem finanszírozható\",2250000-C40-C41-C42-C45-C46-C47-C51-C52-C53)","v":2250000},null,true,null,null,null,{"$f":"IF(ISBLANK(O7),\"\",O7)","v":""},{"$f":"IF(ISBLANK(O7),0,P7+R7)","v":0},0,0,"",null,null,null,"",0,"","","","00:00:00",0,0,0,0,"",null,2,{"$f":"IF(COUNT(AM8)=1,AL7+1,\"\")","v":""},{"$f":"IF(OR(AM7=$C$29,AM7=\"\"),\"\",IFERROR(IF(EDATE($C$28,(AK8-1)*12/$E$19)<=$C$29,EDATE($C$28,(AK8-1)*12/$E$19),$C$29),\"\"))","v":""},{"$f":"+IF(COUNT(AN7)<>0,SUM(AN7:AO7)*(1-M8),\"\")","v":0},{"$f":"IF(torlesztes=\"Egyedi\",-SUMIFS(X$7:X$134,W$7:W$134,\">\"&AM7,W$7:W$134,\"<=\"&AM8),IFERROR(IF(torlesztes=\"Egyenlő tőke\",IF(COUNT($AN$7:AN8)>$E$15,\"\",-$AN$5/$E$15),0),\"\"))","v":0},{"$f":"IF(torlesztes=\"Egyedi\",SUMIFS(AA$7:AA$134,W$7:W$134,\">\"&AM7,W$7:W$134,\"<=\"&AM8)+AG8,IFERROR(-AN8*piacikamat/365*(AM8-AM7),\"\"))","v":""},{"$f":"+IF(COUNT(AQ7)<>0,SUM(AQ7:AR7)*(1-M8),\"\")","v":0},{"$f":"IF(torlesztes=\"Egyedi\",-SUMIFS(X$7:X$134,W$7:W$134,\">\"&AM7,W$7:W$134,\"<=\"&AM8),IFERROR(IF(torlesztes=\"Egyenlő tőke\",IF(COUNT($AQ$7:AQ8)>$E$15,\"\",-$AN$5/$E$15),0),\"\"))","v":0},{"$f":"IF(torlesztes=\"Egyedi\",SUMIFS(AB$7:AB$134,W$7:W$134,\">\"&AM7,W$7:W$134,\"<=\"&AM8)+AH8,IFERROR(-AQ8*tenylegeskamat/365*(AM8-AM7),\"\"))","v":""},null,"",{"$f":"IFERROR(AU8/POWER(1+($C$11+1%)/$E$19,AL8-1)/(1+($C$11+1%)/365*($AM$7-$C$26)),\"\")","v":""},""]
[null,"Hitel devizaneme","EUR",null,"Makrohoz kellenek (ne töröld ki!):",null,null,"Mezőgazdasági szabály",null,null,{"$f":"IF(mezogazdkizarok=0,\"Nem releváns\",IF(MIN(280000-C40-C45-C52,2250000-C40-C41-C42-C45-C46-C47-C51-C52-C53,335000-C40-C41-C45-C46-C52-C53)<=0,\"Nincs szabad keret, nem finanszírozható\",MIN(280000-C40-C45-C52,2250000-C40-C41-C42-C45-C46-C47-C51-C52-C53,335000-C40-C41-C45-C46-C52-C53)))","v":"Nem releváns"},null,true,null,null,null,{"$f":"IF(ISBLANK(O8),\"\",O8)","v":""},{"$f":"IF(ISBLANK(O8),0,P8+R8)","v":0},0,0,"",null,null,null,"",0,"","","","00:00:00",0,0,0,0,"",null,3,{"$f":"IF(COUNT(AM9)=1,AL8+1,\"\")","v":""},"",0,{"$f":"IF(torlesztes=\"Egyedi\",-SUMIFS(X$7:X$134,W$7:W$134,\">\"&AM8,W$7:W$134,\"<=\"&AM9),IFERROR(IF(torlesztes=\"Egyenlő tőke\",IF(COUNT($AN$7:AN9)>$E$15,\"\",-$AN$5/$E$15),0),\"\"))","v":0},"",0,{"$f":"IF(torlesztes=\"Egyedi\",-SUMIFS(X$7:X$134,W$7:W$134,\">\"&AM8,W$7:W$134,\"<=\"&AM9),IFERROR(IF(torlesztes=\"Egyenlő tőke\",IF(COUNT($AQ$7:AQ9)>$E$15,\"\",-$AN$5/$E$15),0),\"\"))","v":0},"",null,"","",""]
[null,"HUF/EUR árfolyam",null,null,{"$f":"+C17/E19","v":{"$error":"#N/A"}},null,null,"Halászati szabály",null,null,{"$f":"IF(halaszatikizarok=0,\"Nem releváns\",IF(MIN(335000-C41-C46-C53,2250000-C40-C41-C42-C45-C46-C47-C51-C52-C53,335000-C40-C41-C45-C46-C52-C53)<=0,\"Nincs szabad keret, nem finanszírozható\",MIN(335000-C41-C46-C53,2250000-C40-C41-C42-C45-C46-C47-C51-C52-C53,335000-C40-C41-C45-C46-C52-C53)))","v":"Nem releváns"},null,true,null,null,null,"",0,0,0,"",null,null,null,"",0,"","","","00:00:00",0,0,0,0,"",null,4,{"$f":"IF(COUNT(AM10)=1,AL9+1,\"\")","v":""},"",0,{"$f":"IF(torlesztes=\"Egyedi\",-SUMIFS(X$7:X$134,W$7:W$134,\">\"&AM9,W$7:W$134,\"<=\"&AM10),IFERROR(IF(torlesztes=\"Egyenlő tőke\",IF(COUNT($AN$7:AN10)>$E$15,\"\",-$AN$5/$E$15),0),\"\"))","v":0},"",0,{"$f":"IF(torlesztes=\"Egyedi\",-SUMIFS(X$7:X$134,W$7:W$134,\">\"&AM9,W$7:W$134,\"<=\"&AM10),IFERROR(IF(torlesztes=\"Egyenlő tőke\",IF(COUNT($AQ$7:AQ10)>$E$15,\"\",-$AN$5/$E$15),0),\"\"))","v":0},"",null,"","",""]
[null,"Reference and discount rates (europa.eu) - Kérjük adja meg a hatályos, devizanem szerinti értéket!",null,null,null,null,"COVID Közlemény 3.1 alapján megítélt támogatásokon felül igénybe vehető szabad keret (EUR)","Általános szabály",null,null,{"$f":"IF(2300000-C45-C46-C47-C51-C52-C53-C56-C57-C58<=0,\"Nincs szabad keret, nem finanszírozható\",2300000-C45-C46-C47-C51-C52-C53-C56-C57-C58)","v":2300000},null,true,null,null,null,"",0,0,0,"",null,null,null,"",0,"","","","00:00:00",0,0,0,0,"",null,5,"","",0,{"$f":"IF(torlesztes=\"Egyedi\",-SUMIFS(X$7:X$134,W$7:W$134,\">\"&AM10,W$7:W$134,\"<=\"&AM11),IFERROR(IF(torlesztes=\"Egyenlő tőke\",IF(COUNT($AN$7:AN11)>$E$15,\"\",-$AN$5/$E$15),0),\"\"))","v":0},"",0,{"$f":"IF(torlesztes=\"Egyedi\",-SUMIFS(X$7:X$134,W$7:W$134,\">\"&AM10,W$7:W$134,\"<=\"&AM11),IFERROR(IF(torlesztes=\"Egyenlő tőke\",IF(COUNT($AQ$7:AQ11)>$E$15,\"\",-$AN$5/$E$15),0),\"\"))","v":0},"",null,"","",""]
[null,"Van hitelfelvevői múltja vagy mérleg alapú hitelminősítése a hitelfelvevőnek?",null,null,1E-4,null,null,"Mezőgazdasági szabály",null,null,{"$f":"IF(mezogazdkizarok=0,\"Nem releváns\",IF(MIN(290000-C45-C52-C56,2300000-C45-C46-C47-C51-C52-C53-C56-C57-C58,345000-C45-C46-C52-C53-C56-C57)<=0,\"Nincs szabad keret, nem finanszírozható\",MIN(290000-C45-C52-C56,2300000-C45-C46-C47-C51-C52-C53-C56-C57-C58,345000-C45-C46-C52-C53-C56-C57)))","v":"Nem releváns"},null,true,null,null,null,"",0,0,0,"",null,null,null,"",0,"","","","00:00:00",0,0,0,0,"",null,6,"","",0,{"$f":"IF(torlesztes=\"Egyedi\",-SUMIFS(X$7:X$134,W$7:W$134,\">\"&AM11,W$7:W$134,\"<=\"&AM12),IFERROR(IF(torlesztes=\"Egyenlő tőke\",IF(COUNT($AN$7:AN12)>$E$15,\"\",-$AN$5/$E$15),0),\"\"))","v":0},"",0,{"$f":"IF(torlesztes=\"Egyedi\",-SUMIFS(X$7:X$134,W$7:W$134,\">\"&AM11,W$7:W$134,\"<=\"&AM12),IFERROR(IF(torlesztes=\"Egyenlő tőke\",IF(COUNT($AQ$7:AQ12)>$E$15,\"\",-$AN$5/$E$15),0),\"\"))","v":0},"",null,"","",""]
[null,"Cégbesorolás",null,null,null,null,null,"Halászati szabály",null,null,{"$f":"IF(halaszatikizarok=0,\"Nem releváns\",IF(MIN(345000-C46-C53-C57,2300000-C45-C46-C47-C51-C52-C53-C56-C57-C58,345000-C45-C46-C52-C53-C56-C57)<=0,\"Nincs szabad keret, nem finanszírozható\",MIN(345000-C46-C53-C57,2300000-C45-C46-C47-C51-C52-C53-C56-C57-C58,345000-C45-C46-C52-C53-C56-C57)))","v":"Nem releváns"},null,true,null,null,null,"",0,0,0,"",null,null,null,"",0,"","","","00:00:00",0,0,0,0,"",null,7,"","",0,{"$f":"IF(torlesztes=\"Egyedi\",-SUMIFS(X$7:X$134,W$7:W$134,\">\"&AM12,W$7:W$134,\"<=\"&AM13),IFERROR(IF(torlesztes=\"Egyenlő tőke\",IF(COUNT($AN$7:AN13)>$E$15,\"\",-$AN$5/$E$15),0),\"\"))","v":0},"",0,{"$f":"IF(torlesztes=\"Egyedi\",-SUMIFS(X$7:X$134,W$7:W$134,\">\"&AM12,W$7:W$134,\"<=\"&AM13),IFERROR(IF(torlesztes=\"Egyenlő tőke\",IF(COUNT($AQ$7:AQ13)>$E$15,\"\",-$AN$5/$E$15),0),\"\"))","v":0},"",null,"","",""]
[null,"Adósminősítés",null,null,null,null,null,null,null,null,null,null,true,null,null,null,"",0,0,0,"",null,null,null,"",0,"","","","00:00:00",0,0,0,0,"",null,8,"","",0,{"$f":"IF(torlesztes=\"Egyedi\",-SUMIFS(X$7:X$134,W$7:W$134,\">\"&AM13,W$7:W$134,\"<=\"&AM14),IFERROR(IF(torlesztes=\"Egyenlő tőke\",IF(COUNT($AN$7:AN14)>$E$15,\"\",-$AN$5/$E$15),0),\"\"))","v":0},"",0,{"$f":"IF(torlesztes=\"Egyedi\",-SUMIFS(X$7:X$134,W$7:W$134,\">\"&AM13,W$7:W$134,\"<=\"&AM14),IFERROR(IF(torlesztes=\"Egyenlő tőke\",IF(COUNT($AQ$7:AQ14)>$E$15,\"\",-$AN$5/$E$15),0),\"\"))","v":0},"",null,"","",""]
[null,"Fedezettség",null,null,{"$f":"COUNT(AL7:AL134)","v":0},null,"Teljes(kumulált) támogatás intenzítása",null,null,null,null,null,true,null,null,null,"",0,0,0,"",null,null,null,"",0,"","","","00:00:00",0,0,0,0,"",null,9,"","",0,{"$f":"IF(torlesztes=\"Egyedi\",-SUMIFS(X$7:X$134,W$7:W$134,\">\"&AM14,W$7:W$134,\"<=\"&AM15),IFERROR(IF(torlesztes=\"Egyenlő tőke\",IF(COUNT($AN$7:AN15)>$E$15,\"\",-$AN$5/$E$15),0),\"\"))","v":0},"",0,{"$f":"IF(torlesztes=\"Egyedi\",-SUMIFS(X$7:X$134,W$7:W$134,\">\"&AM14,W$7:W$134,\"<=\"&AM15),IFERROR(IF(torlesztes=\"Egyenlő tőke\",IF(COUNT($AQ$7:AQ15)>$E$15,\"\",-$AN$5/$E$15),0),\"\"))","v":0},"",null,"","",""]
[null,"Kockázati felár (bázispont)",{"$f":"IF(C12=\"Van\",OFFSET(Adatok!$E$4,MATCH(C14,Adatok!$E$5:$E$9,0),MATCH(C15,Adatok!$F$4:$H$4,0),),MAX(OFFSET(Adatok!$E$4,MATCH(C14,Adatok!$E$5:$E$9,0),MATCH(C15,Adatok!$F$4:$H$4,0),),400))","v":{"$error":"#N/A"}},null,null,null,"Beruházás elszámolható költsége (HUF)",{"$f":"C23*IF(C9=\"EUR\",arfolyam,1)","v":0},null,null,null,null,true,null,null,null,"",0,0,0,"",null,null,null,"",0,"","","","00:00:00",0,0,0,0,"",null,10,{"$f":"IF(COUNT(AM16)=1,AL15+1,\"\")","v":""},"",0,{"$f":"IF(torlesztes=\"Egyedi\",-SUMIFS(X$7:X$134,W$7:W$134,\">\"&AM15,W$7:W$134,\"<=\"&AM16),IFERROR(IF(torlesztes=\"Egyenlő tőke\",IF(COUNT($AN$7:AN16)>$E$15,\"\",-$AN$5/$E$15),0),\"\"))","v":0},"",0,{"$f":"IF(torlesztes=\"Egyedi\",-SUMIFS(X$7:X$134,W$7:W$134,\">\"&AM15,W$7:W$134,\"<=\"&AM16),IFERROR(IF(torlesztes=\"Egyenlő tőke\",IF(COUNT($AQ$7:AQ16)>$E$15,\"\",-$AN$5/$E$15),0),\"\"))","v":0},"",null,"","",""]
[null,"Egyéni referencia kamatláb",{"$f":"+(C11+C16/10000)","v":{"$error":"#N/A"}},null,null,null,"Hitelre jutó támogatás intenzítása",{"$f":"(J5+J6)/forintelszamolhato","v":{"$error":"#DIV/0!"}},null,null,null,null,true,null,null,null,"",0,0,0,"",null,null,null,"",0,"","","","00:00:00",0,0,0,0,"",null,11,{"$f":"IF(COUNT(AM17)=1,AL16+1,\"\")","v":""},"",0,{"$f":"IF(torlesztes=\"Egyedi\",-SUMIFS(X$7:X$134,W$7:W$134,\">\"&AM16,W$7:W$134,\"<=\"&AM17),IFERROR(IF(torlesztes=\"Egyenlő tőke\",IF(COUNT($AN$7:AN17)>$E$15,\"\",-$AN$5/$E$15),0),\"\"))","v":0},"",0,{"$f":"IF(torlesztes=\"Egyedi\",-SUMIFS(X$7:X$134,W$7:W$134,\">\"&AM16,W$7:W$134,\"<=\"&AM17),IFERROR(IF(torlesztes=\"Egyenlő tőke\",IF(COUNT($AQ$7:AQ17)>$E$15,\"\",-$AN$5/$E$15),0),\"\"))","v":0},"",null,"","",""]
[null,null,null,null,null,null,"Adott beruházási költséghez kapcsolódó teljes támogatás összege (HUF)",{"$f":"J5+J6+IF(C35=\"Egyéb támogatások: pl. Egyéb GBER (pl. 38, 41, stb), EMVA\",SUM(D45:D53)+C68,IF(C35=\"GBER 14, 17-es jogcímek\",SUM(D45:D53)+D61+D63,SUM(D45:D53)))","v":0},null,null,null,null,true,null,null,null,"",0,0,0,"",null,null,null,"",0,"","","","00:00:00",0,0,0,0,"",null,12,"","",0,{"$f":"IF(torlesztes=\"Egyedi\",-SUMIFS(X$7:X$134,W$7:W$134,\">\"&AM17,W$7:W$134,\"<=\"&AM18),IFERROR(IF(torlesztes=\"Egyenlő tőke\",IF(COUNT($AN$7:AN18)>$E$15,\"\",-$AN$5/$E$15),0),\"\"))","v":0},"",0,{"$f":"IF(torlesztes=\"Egyedi\",-SUMIFS(X$7:X$134,W$7:W$134,\">\"&AM17,W$7:W$134,\"<=\"&AM18),IFERROR(IF(torlesztes=\"Egyenlő tőke\",IF(COUNT($AQ$7:AQ18)>$E$15,\"\",-$AN$5/$E$15),0),\"\"))","v":0},"",null,"","",""]
[null,"HITELKARAKTERISZTIKA",null,null,{"$f":"VLOOKUP($C$32,Adatok!P3:Q5,2,0)","v":{"$error":"#N/A"}},null,"Teljes támogatás intenzítása",{"$f":"H18/forintelszamolhato","v":{"$error":"#DIV/0!"}},null,null,null,null,true,null,null,null,"",0,0,0,"",null,null,null,"",0,"","","","00:00:00",0,0,0,0,"",null,13,"","",0,{"$f":"IF(torlesztes=\"Egyedi\",-SUMIFS(X$7:X$134,W$7:W$134,\">\"&AM18,W$7:W$134,\"<=\"&AM19),IFERROR(IF(torlesztes=\"Egyenlő tőke\",IF(COUNT($AN$7:AN19)>$E$15,\"\",-$AN$5/$E$15),0),\"\"))","v":0},"",0,{"$f":"IF(torlesztes=\"Egyedi\",-SUMIFS(X$7:X$134,W$7:W$134,\">\"&AM18,W$7:W$134,\"<=\"&AM19),IFERROR(IF(torlesztes=\"Egyenlő tőke\",IF(COUNT($AQ$7:AQ19)>$E$15,\"\",-$AN$5/$E$15),0),\"\"))","v":0},"",null,"","",""]
[null,"Hitel fajtája/célja","Lízing",null,null,null,null,null,null,null,null,null,true,null,null,null,"",0,0,0,"",null,null,null,"",0,"","","","00:00:00",0,0,0,0,"",null,14,"","",0,{"$f":"IF(torlesztes=\"Egyedi\",-SUMIFS(X$7:X$134,W$7:W$134,\">\"&AM19,W$7:W$134,\"<=\"&AM20),IFERROR(IF(torlesztes=\"Egyenlő tőke\",IF(COUNT($AN$7:AN20)>$E$15,\"\",-$AN$5/$E$15),0),\"\"))","v":0},"",0,{"$f":"IF(torlesztes=\"Egyedi\",-SUMIFS(X$7:X$134,W$7:W$134,\">\"&AM19,W$7:W$134,\"<=\"&AM20),IFERROR(IF(torlesztes=\"Egyenlő tőke\",IF(COUNT($AQ$7:AQ20)>$E$15,\"\",-$AN$5/$E$15),0),\"\"))","v":0},"",null,"","",""]
{"$rows_left_out":115}
{"sheet":"Szamitasok","index":2,"n_rows":25,"n_cols":9,"rows_kept":25,"cut":false,"hidden":true,"merged":[[19,0,19,9],[17,0,17,9],[21,0,21,9],[0,0,0,9],[2,0,2,1],[6,0,6,9],[7,0,7,9]]}
["Kizárók és KO-k"]
[null,null,null,"Váll. Méret","Mezőgazdasági","Halászat/akvakultúra",null,null,"Régió"]
["Szorzó értéke",null,null,{"$f":"Tamogatastartalom!C21","v":0},null,null,null,null,{"$f":"Tamogatastartalom!C37","v":0}]
[{"$f":"PRODUCT(C4:W4)","v":1},"általános",null,null,null,null,null,1]
[{"$f":"PRODUCT(E5:F5)","v":0},"mezőgazdasági",null,null,{"$f":"IF(Tamogatastartalom!C22=\"Mezőgazdasági\",1,0)","v":0},null,null,{"$f":"PRODUCT(I5)","v":1},{"$f":"IF(I3=\"Budapest\",0,1)","v":1}]
[{"$f":"PRODUCT(E6:F6)","v":0},"halászati",null,null,null,{"$f":"IF(Tamogatastartalom!C22=\"Halászati\",1,0)","v":0},null,1]
["14-es cikk"]
["R szorzó értéke"]
["Elszámolható ktg-ek EUR-ban",{"$f":"Tamogatastartalom!C23/IF(Tamogatastartalom!C9<>\"EUR\",arfolyam,1)","v":0}]
["A Elszámolható költségek",{"$f":"IF((B9-C10)>0,C10,B9)","v":0},55000000]
["B Elszámolható költségek",{"$f":"IF(B10<C10,0,IF(B9-C11<0,B9-C10,C10))","v":0},110000000]
["C elszámolható költségek","nincs!"]
["KKV bónusz",{"$f":"IF(D3=\"Mikró/Kis\",0.2,IF(D3=\"Közepes\",0.1,0))*IF(B9<50*10^6,1,0)","v":0}]
["Kaphat?",{"$f":"IF(B15>0,1,0)","v":{"$error":"#N/A"}}]
["Alap intenzitás",{"$f":"VLOOKUP(Tamogatastartalom!C37,Adatok!A12:B20,2,FALSE)","v":{"$error":"#N/A"}}]
["R szorzó értéke a támogatási térkép alapján",{"$f":"(B15+B13)*B14","v":{"$error":"#N/A"}}]
["Max. TT (EUR)",{"$f":"VLOOKUP(B15,Adatok!D12:E17,2,FALSE)*10^6","v":{"$error":"#N/A"}}]
["17-es cikk"]
["Vállalatméret-szorzó",{"$f":"IF(D3=\"Mikró/Kis\",0.2,IF(D3=\"Közepes\",0.1,0))","v":0}]
["HUF érték"]
{"$rows_left_out":6}
{"sheet":"Adatok","index":3,"n_rows":25,"n_cols":21,"rows_kept":25,"cut":false,"hidden":true,"merged":[[9,0,9,11],[0,12,0,22],[4,3,8,3],[1,3,1,7],[2,5,2,7],[0,0,0,11],[1,9,1,11]]}
["Felárak",null,null,null,null,null,null,null,null,null,null,null,"Segédszámítások"]
[null,null,null,"Piaci referencia",null,null,null,null,null,"Refin kamatok",null,null,"Törlesztés",null,null,"Törlesztésgyakoriság",null,null,"Select",null,"Select"]
[null,null,null,null,null,"Fedezettség",null,null,null,null,null,null,"Egyenlő összeg",1,null,"Havi",12,null,"Beruházási hitel",null,"Beruházási hitel"]
[null,null,null,null,null,"Magas","Általános","Alacsony",null,"Min 1",{"$f":"refkam-3.5%","v":-3.5000000000000003E-2},null,"Egyenlő tőke",2,null,"Negyedéves",4,null,"Forgóeszközhitel",null,"Lízing"]
[null,null,null,"Hitelminősítés","Kiváló",60,75,100,null,"Min2",1E-3,null,"Annuitás",0,null,"Féléves",2,null,"Lízing"]
[null,null,null,null,"Jó",75,100,220,null,"Tényleges min",{"$f":"MAX(K4:K5)","v":1E-3},null,"Egyedi"]
[null,null,null,null,"Kielégítő",100,220,400,null,"Max",{"$f":"refkammin+4%","v":4.1000000000000002E-2}]
[null,null,null,null,"Gyenge",220,400,650]
[null,null,null,null,"Rossz",400,650,1000]
["Regionális támogatási intenzitások"]
[null,"Nagyvállalat",null,"Intenzitás","MAX Támogatástartalom (mio EUR)"]
["Select",0,null,0.5,37.5]
["Dél-Alföld",0.5,null,0.35,26.25,"zöld ügyleti kamat","HUF","EUR","ügyleti kamat","HUF","EUR"]
["Dél-Dunántúl",0.5,null,0.3,22.5,"min",0.03,5.0000000000000001E-3,"min",{"$f":"IF(Tamogatastartalom!$C$9=\"HUF\",0.035,0.01)","v":0.01},0.01]
["Észak-Alföld",0.5,null,0.25,18.75,"max",0.115,7.4999999999999997E-2,"max",0.12,0.08]
["Észak-Magyarország",0.5,null,0.2,15]
["Közép-Dunántúl",0.3,null,0,0,null,null,null,"2.3 min kamat"," "]
["Pest",0.5,null,null,null,null,null,null,"EUR",13,25,37,49,61,73,85]
["Nyugat-Dunántúl",0.3,null,null,null,null,null,null,"Mikró/Kis",1.46E-2,1.5099999999999999E-2,1.7600000000000001E-2,1.8800000000000001E-2,1.95E-2,2.98E-2,3.1699999999999999E-2]
["Budapest",0,null,null,null,null,null,null,"Közepes",1.46E-2,1.5099999999999999E-2,1.7600000000000001E-2,1.8800000000000001E-2,1.95E-2,2.98E-2,3.1699999999999999E-2]
{"$rows_left_out":5}