{"text_format":"1","workbook":"xlsx","n_sheets":4,"sheets":["Elolap","Tamogatastartalom","Szamitasok","Adatok"],"not_rendered":{"charts":0,"images":0,"macros":0,"external_links":0,"defined_names":58,"comments":1,"pivot_tables":0},"unopened":[],"bounds":{"document_bytes":16777216,"sheet_cells":100000,"rows_first":2000,"rows_last":500,"rows_between":2000,"halvings":0,"cell_chars":16384,"cell_head_chars":4096},"cells_cut":0,"cells_raw":0,"read":"whole","date_system":"1900"}

{"sheet":"Elolap","index":0,"n_rows":0,"n_cols":0,"rows_kept":0,"cut":false,"hidden":false,"merged":[]}

{"sheet":"Tamogatastartalom","index":1,"n_rows":126,"n_cols":47,"rows_kept":126,"cut":false,"hidden":false,"merged":[[2,46,3,46],[3,4,4,4],[2,19,3,19],[2,20,3,20],[2,43,2,44],[2,39,2,41],[2,21,2,24],[2,26,2,30],[2,36,2,38],[2,11,3,11],[2,12,3,12],[2,5,2,7],[3,5,3,7],[4,5,4,7],[0,19,1,20],[0,11,1,12],[3,1,3,2],[6,5,6,8],[5,1,5,2]]}
[null,null,null,null,null,null,null,null,null,null,null,{"$f":"IF(SUM(M7:M126)<C24,\"A folyósítások összege kevesebb, mint a hitelösszeg\",\"A folyósítások összege több, mint a hitelösszeg\")","v":"A folyósítások összege több, mint a hitelösszeg"},null,null,null,null,null,null,null,{"$f":"IF(SUM(U7:U126)<C24,\"A törlesztések összege kevesebb, mint a hitelösszeg\",\"A törlesztések összege több, mint a hitelösszeg\")","v":"A törlesztések összege több, mint a hitelösszeg"}]
[]
[null,"Ügyfél neve: ",null,null,null,"Hitelösszeg (EUR)",null,null,{"$f":"IF(C9=\"HUF\",C24/C10,C24)","v":0},null,null,"Egyedi folyósítás dátuma","Folyósítás összege",null,null,null,null,null,null,"Egyedi törlesztés dátuma","Tőkeamortizáció egyedi törlesztés esetén","periódusközi kamatszámítás",null,null,null,null,"maradék kamatszámítás",null,null,null,null,null,null,null,null,null,"Piaci konstrukció",null,null,"Támogatott konstruckió",null,null,null,"Támogatástartalom",null,null,"Támogatástartalom + egyéb kedvezmények"]
[null,null,null,-0.04,null,{"$f":"IF(tenylegestt=0,\"Az ügylet nem finanszírozható\",\"Ténylegesen felvett hitel támogatástartalma (EUR)\")","v":"Az ügylet nem finanszírozható"},null,null,{"$f":"IF(C9=\"HUF\",AR5/C10,AR5)","v":0},null,null,null,null,null,null,"kamat","támogatott",null,null,null,null,"dátumtól","tőke","kamat","támogatott",null,"dátumtól","amort","tőke","maradék","t maradék",null,null,null,"Periodus","Dátum","Tőke","Tőkeamt.","Kamatfiz.","Tőke","Tőkeamt.","Kamatfiz.",null,"FV","PV"]
[null,"Pénzügyi intézmény neve refinanszírozás esetén: ",null,null,null,"Hitelösszeg (HUF)",null,null,{"$f":"I3*C10","v":0},null,null,null,null,null,null,{"$f":"SUM(P7:P126)","v":0},{"$f":"SUM(Q7:Q126)","v":0},null,null,null,null,null,null,{"$f":"SUM(X7:X126)","v":0},{"$f":"SUM(Y7:Y126)","v":0},null,null,null,null,{"$f":"SUM(AD7:AD126)","v":0},{"$f":"SUM(AE7:AE126)","v":0},null,null,null,null,null,{"$f":"+AK7","v":0},{"$f":"SUM(AL7:AL126)","v":0},{"$f":"SUM(AM7:AM126)","v":0},{"$f":"+AN7","v":0},{"$f":"SUM(AO7:AO126)","v":0},{"$f":"SUM(AP7:AP126)","v":0},null,{"$f":"SUM(AR7:AR126)","v":0},{"$f":"SUM(AS7:AS126)","v":0},null,{"$f":"AS5","v":0}]
[null,null,null,null,null,null,null,null,null,"Törlesztésiidőszak vége?",null,null,null,null,null,null,null,null,null,null,null,null,null,null,null,null,null,null,null,null,null,null,null,null,0,{"$f":"MAX(C26,MIN(L7:L126))","v":"00:00:00"}]
[null,null,null,null,null,"COVID Közlemény 3.1 alapján megítélt támogatásokon felül igénybe vehető szabad keret",null,null,null,{"$f":"AI7>$D$15","v":true},null,null,null,{"$f":"C26","v":"00:00:00"},{"$f":"IF(ISBLANK(L7),C24,0)","v":0},{"$f":"IF(AND(ISBLANK(L6),AH7<>1),0,IFERROR(-O7*piacikamat/365*(IF(ISBLANK(L7),$C$27,L7)-N7),\"\"))","v":""},{"$f":"IF(AND(ISBLANK(L6),AH7<>1),0,IFERROR(-O7*tenylegeskamat/365*(IF(ISBLANK(L7),$C$27,L7)-N7),\"\"))","v":0},{"$f":"IFERROR(IF(ISBLANK(L7),$C$27,L7)-N7,\"\")","v":0},null,null,null,{"$f":"IF(ISNA(MAX(T6,INDEX(AJ$6:AJ$126,MATCH(T7-1,AJ$6:AJ$126,1)))),\"\",MAX(T6,INDEX(AJ$6:AJ$126,MATCH(T7-1,AJ$6:AJ$126,1))))","v":""},{"$f":"IF(ISNA(MIN(IF(OR(ISBLANK(W6),W6=\"\"),INDEX(AK$7:AK$126,MATCH(T7,AJ$7:AJ$126,1)),W6-U6),INDEX(AK$7:AK$126,MATCH(T7,AJ$7:AJ$126,1)))),\"\",MIN(IF(OR(ISBLANK(W6),W6=\"\"),INDEX(AK$7:AK$126,MATCH(T7,AJ$7:AJ$126,1)),W6-U6),INDEX(AK$7:AK$126,MATCH(T7,AJ$7:AJ$126,1))))","v":0},{"$f":"IFERROR(-W7*piacikamat/365*(T7-V7),\"\")","v":""},{"$f":"IFERROR(-W7*tenylegeskamat/365*(T7-V7),\"\")","v":""},{"$f":"IFERROR(T7-V7,\"\")","v":""},{"$f":"MAX(AJ6,IF(ISNA(INDEX(T$7:T$126,MATCH(AJ7,T$7:T$126,1))),0,INDEX(T$7:T$126,MATCH(AJ7,T$7:T$126,1))))","v":"00:00:00"},{"$f":"IF(ISNA(INDEX(U$7:U$126,MATCH(AJ7,T$7:T$126,1))),0,INDEX(U$7:U$126,MATCH(AJ7,T$7:T$126,1)))","v":0},{"$f":"IF(ISNA(INDEX(W$7:W$126,MATCH(AJ7,T$7:T$126,1))),AK7,INDEX(W$7:W$126,MATCH(AJ7,T$7:T$126,1)))","v":0},{"$f":"IFERROR(-(AC7-AB7)*piacikamat/365*(AJ7-AA7),0)","v":0},{"$f":"IFERROR(-(AC7-AB7)*tenylegeskamat/365*(AJ7-AA7),0)","v":0},{"$f":"IFERROR(AJ7-AA7,\"\")","v":0},null,1,{"$f":"+IF(C28-C27<>0,1,\"\")","v":""},{"$f":"C27","v":"00:00:00"},{"$f":"IF(+C24<>0,C24,IF(AI7>0,C24*J7,\"\"))","v":0},{"$f":"IF(torlesztes=\"Egyedi\",-SUMIFS(U$7:U$126,T$7:T$126,\">\"&AJ6,T$7:T$126,\"<=\"&AJ7),IFERROR(IF(torlesztes=\"Egyenlő tőke\",IF(COUNT($AK$7:AK7)>$D$15,\"\",-$AK$5/$D$15),0),\"\"))","v":0},{"$f":"SUM(P7:P126)","v":0},{"$f":"+AK7","v":0},{"$f":"IF(torlesztes=\"Egyedi\",-SUMIFS(U$7:U$126,T$7:T$126,\">\"&AJ6,T$7:T$126,\"<=\"&AJ7),IFERROR(IF(torlesztes=\"Egyenlő tőke\",IF(COUNT($AN$7:AN7)>$D$15,\"\",-$AK$5/$D$15),0),\"\"))","v":0},{"$f":"SUM(Q7:Q126)","v":0},null,{"$f":"IFERROR(MAX((ABS(AM7)-ABS(AP7)),0),\"\")","v":0},{"$f":"IFERROR(AR7/(1+($C$11+1%)/365*(AJ7-C25)),\"\")","v":0},{"$f":"IFERROR(AJ7-AJ6,\"\")","v":0}]
[null,"PIACI KAMAT MEGHATÁROZÁSA",null,null,null,null,"Általános szabály","Mezőgazdasági szabály","Halászati szabály",{"$f":"AI8>$D$15","v":true},null,null,null,{"$f":"IF(ISBLANK(L7),\"\",L7)","v":""},{"$f":"IF(ISBLANK(L7),0,M7+O7)","v":0},0,0,"",null,null,null,{"$f":"IF(ISNA(MAX(T7,INDEX(AJ$6:AJ$126,MATCH(T8-1,AJ$6:AJ$126,1)))),\"\",MAX(T7,INDEX(AJ$6:AJ$126,MATCH(T8-1,AJ$6:AJ$126,1))))","v":""},{"$f":"IF(ISNA(MIN(IF(OR(ISBLANK(W7),W7=\"\"),INDEX(AK$7:AK$126,MATCH(T8,AJ$7:AJ$126,1)),W7-U7),INDEX(AK$7:AK$126,MATCH(T8,AJ$7:AJ$126,1)))),\"\",MIN(IF(OR(ISBLANK(W7),W7=\"\"),INDEX(AK$7:AK$126,MATCH(T8,AJ$7:AJ$126,1)),W7-U7),INDEX(AK$7:AK$126,MATCH(T8,AJ$7:AJ$126,1))))","v":0},"","","",{"$f":"MAX(AJ7,IF(ISNA(INDEX(T$7:T$126,MATCH(AJ8,T$7:T$126,1))),0,INDEX(T$7:T$126,MATCH(AJ8,T$7:T$126,1))))","v":"00:00:00"},{"$f":"IF(ISNA(INDEX(U$7:U$126,MATCH(AJ8,T$7:T$126,1))),0,INDEX(U$7:U$126,MATCH(AJ8,T$7:T$126,1)))","v":0},{"$f":"IF(ISNA(INDEX(W$7:W$126,MATCH(AJ8,T$7:T$126,1))),AK8,INDEX(W$7:W$126,MATCH(AJ8,T$7:T$126,1)))","v":0},0,0,"",null,2,{"$f":"IF(COUNT(AJ8)=1,AI7+1,\"\")","v":""},{"$f":"IF(OR(AJ7=$C$28,AJ7=\"\"),\"\",IFERROR(IF(EDATE($C$27,(AH8-1)*12/$D$19)<=$C$28,EDATE($C$27,(AH8-1)*12/$D$19),$C$28),\"\"))","v":""},{"$f":"+IF(COUNT(AK7)<>0,SUM(AK7:AL7)*(1-J8),\"\")","v":0},{"$f":"IF(torlesztes=\"Egyedi\",-SUMIFS(U$7:U$126,T$7:T$126,\">\"&AJ7,T$7:T$126,\"<=\"&AJ8),IFERROR(IF(torlesztes=\"Egyenlő tőke\",IF(COUNT($AK$7:AK8)>$D$15,\"\",-$AK$5/$D$15),0),\"\"))","v":0},{"$f":"IF(torlesztes=\"Egyedi\",SUMIFS(X$7:X$126,T$7:T$126,\">\"&AJ7,T$7:T$126,\"<=\"&AJ8)+AD8,IFERROR(-AK8*piacikamat/365*(AJ8-AJ7),\"\"))","v":""},{"$f":"+IF(COUNT(AN7)<>0,SUM(AN7:AO7)*(1-J8),\"\")","v":0},{"$f":"IF(torlesztes=\"Egyedi\",-SUMIFS(U$7:U$126,T$7:T$126,\">\"&AJ7,T$7:T$126,\"<=\"&AJ8),IFERROR(IF(torlesztes=\"Egyenlő tőke\",IF(COUNT($AN$7:AN8)>$D$15,\"\",-$AK$5/$D$15),0),\"\"))","v":0},{"$f":"IF(torlesztes=\"Egyedi\",SUMIFS(Y$7:Y$126,T$7:T$126,\">\"&AJ7,T$7:T$126,\"<=\"&AJ8)+AE8,IFERROR(-AN8*tenylegeskamat/365*(AJ8-AJ7),\"\"))","v":""},null,{"$f":"IFERROR(MAX((ABS(AM8)-ABS(AP8)),0),\"\")","v":""},{"$f":"IFERROR(AR8/POWER(1+($C$11+1%)/$D$19,AI8-1)/(1+($C$11+1%)/365*($AJ$7-$C$25)),\"\")","v":""},""]
[null,"Hitel devizaneme",null,"Makrohoz kellenek (ne töröld ki!):",null,null,null,null,null,true,null,null,null,{"$f":"IF(ISBLANK(L8),\"\",L8)","v":""},{"$f":"IF(ISBLANK(L8),0,M8+O8)","v":0},0,0,"",null,null,null,"",0,"","","","00:00:00",0,0,0,0,"",null,3,{"$f":"IF(COUNT(AJ9)=1,AI8+1,\"\")","v":""},"",0,{"$f":"IF(torlesztes=\"Egyedi\",-SUMIFS(U$7:U$126,T$7:T$126,\">\"&AJ8,T$7:T$126,\"<=\"&AJ9),IFERROR(IF(torlesztes=\"Egyenlő tőke\",IF(COUNT($AK$7:AK9)>$D$15,\"\",-$AK$5/$D$15),0),\"\"))","v":0},"",0,{"$f":"IF(torlesztes=\"Egyedi\",-SUMIFS(U$7:U$126,T$7:T$126,\">\"&AJ8,T$7:T$126,\"<=\"&AJ9),IFERROR(IF(torlesztes=\"Egyenlő tőke\",IF(COUNT($AN$7:AN9)>$D$15,\"\",-$AK$5/$D$15),0),\"\"))","v":0},"",null,"","",""]
[null,"HUF/EUR árfolyam",null,{"$f":"+C17/D19","v":{"$error":"#N/A"}},null,"Maximális hitelösszeghez tartozó támogatástartalom (EUR)",{"$f":"IF(2300000-C39-C40-C41-C44-C45-C46-C47-C48-C49<=0,\"Nem jogosult\",2300000-C39-C40-C41-C44-C45-C46-C47-C48-C49)","v":2300000},{"$f":"IF(mezogazdkizarok=0,\"Nem releváns\",IF(MIN(290000-C39-C44-C48,2300000-C39-C40-C41-C44-C45-C46-C47-C48-C49,345000-C39-C40-C44-C45-C48-C49)<=0,\"Nem jogosult\",MIN(290000-C39-C44-C48,2300000-C39-C40-C41-C44-C45-C46-C47-C48-C49,345000-C39-C40-C44-C45-C48-C49)))","v":"Nem releváns"},{"$f":"IF(halaszatikizarok=0,\"Nem releváns\",IF(MIN(345000-C40-C45-C49,2300000-C39-C40-C41-C44-C45-C46-C47-C48-C49,345000-C39-C40-C44-C45-C48-C49)<=0,\"Nem jogosult\",MIN(345000-C40-C45-C49,2300000-C39-C40-C41-C44-C45-C46-C47-C48-C49,345000-C39-C40-C44-C45-C48-C49)))","v":"Nem releváns"},true,null,null,null,"",0,0,0,"",null,null,null,"",0,"","","","00:00:00",0,0,0,0,"",null,4,{"$f":"IF(COUNT(AJ10)=1,AI9+1,\"\")","v":""},"",0,{"$f":"IF(torlesztes=\"Egyedi\",-SUMIFS(U$7:U$126,T$7:T$126,\">\"&AJ9,T$7:T$126,\"<=\"&AJ10),IFERROR(IF(torlesztes=\"Egyenlő tőke\",IF(COUNT($AK$7:AK10)>$D$15,\"\",-$AK$5/$D$15),0),\"\"))","v":0},"",0,{"$f":"IF(torlesztes=\"Egyedi\",-SUMIFS(U$7:U$126,T$7:T$126,\">\"&AJ9,T$7:T$126,\"<=\"&AJ10),IFERROR(IF(torlesztes=\"Egyenlő tőke\",IF(COUNT($AN$7:AN10)>$D$15,\"\",-$AK$5/$D$15),0),\"\"))","v":0},"",null,"","",""]
[null,"Referencia alapkamat - Kérjük adja meg a hatályos, devizanem szerinti értéket!",null,null,null,null,null,null,null,true,null,null,null,"",0,0,0,"",null,null,null,"",0,"","","","00:00:00",0,0,0,0,"",null,5,"","",0,{"$f":"IF(torlesztes=\"Egyedi\",-SUMIFS(U$7:U$126,T$7:T$126,\">\"&AJ10,T$7:T$126,\"<=\"&AJ11),IFERROR(IF(torlesztes=\"Egyenlő tőke\",IF(COUNT($AK$7:AK11)>$D$15,\"\",-$AK$5/$D$15),0),\"\"))","v":0},"",0,{"$f":"IF(torlesztes=\"Egyedi\",-SUMIFS(U$7:U$126,T$7:T$126,\">\"&AJ10,T$7:T$126,\"<=\"&AJ11),IFERROR(IF(torlesztes=\"Egyenlő tőke\",IF(COUNT($AN$7:AN11)>$D$15,\"\",-$AK$5/$D$15),0),\"\"))","v":0},"",null,"","",""]
[null,"Van hitelfelvevői múltja vagy mérleg alapú hitelminősítése a hitelfelvevőnek?",null,1E-4,null,"Teljes(kumulált) támogatás intenzítása",null,null,null,true,null,null,null,"",0,0,0,"",null,null,null,"",0,"","","","00:00:00",0,0,0,0,"",null,6,"","",0,{"$f":"IF(torlesztes=\"Egyedi\",-SUMIFS(U$7:U$126,T$7:T$126,\">\"&AJ11,T$7:T$126,\"<=\"&AJ12),IFERROR(IF(torlesztes=\"Egyenlő tőke\",IF(COUNT($AK$7:AK12)>$D$15,\"\",-$AK$5/$D$15),0),\"\"))","v":0},"",0,{"$f":"IF(torlesztes=\"Egyedi\",-SUMIFS(U$7:U$126,T$7:T$126,\">\"&AJ11,T$7:T$126,\"<=\"&AJ12),IFERROR(IF(torlesztes=\"Egyenlő tőke\",IF(COUNT($AN$7:AN12)>$D$15,\"\",-$AK$5/$D$15),0),\"\"))","v":0},"",null,"","",""]
[null,"Cégbesorolás",null,null,null,"Beruházás elszámolható költsége (EUR)",{"$f":"C23/IF(C9<>\"EUR\",arfolyam,1)","v":{"$error":"#DIV/0!"}},null,null,true,null,null,null,"",0,0,0,"",null,null,null,"",0,"","","","00:00:00",0,0,0,0,"",null,7,"","",0,{"$f":"IF(torlesztes=\"Egyedi\",-SUMIFS(U$7:U$126,T$7:T$126,\">\"&AJ12,T$7:T$126,\"<=\"&AJ13),IFERROR(IF(torlesztes=\"Egyenlő tőke\",IF(COUNT($AK$7:AK13)>$D$15,\"\",-$AK$5/$D$15),0),\"\"))","v":0},"",0,{"$f":"IF(torlesztes=\"Egyedi\",-SUMIFS(U$7:U$126,T$7:T$126,\">\"&AJ12,T$7:T$126,\"<=\"&AJ13),IFERROR(IF(torlesztes=\"Egyenlő tőke\",IF(COUNT($AN$7:AN13)>$D$15,\"\",-$AK$5/$D$15),0),\"\"))","v":0},"",null,"","",""]
[null,"Adósminősítés",null,null,null,"Hitelre jutó támogatás intenzítása (EUR)",{"$f":"I4/eurelszamolhato","v":{"$error":"#DIV/0!"}},null,null,true,null,null,null,"",0,0,0,"",null,null,null,"",0,"","","","00:00:00",0,0,0,0,"",null,8,"","",0,{"$f":"IF(torlesztes=\"Egyedi\",-SUMIFS(U$7:U$126,T$7:T$126,\">\"&AJ13,T$7:T$126,\"<=\"&AJ14),IFERROR(IF(torlesztes=\"Egyenlő tőke\",IF(COUNT($AK$7:AK14)>$D$15,\"\",-$AK$5/$D$15),0),\"\"))","v":0},"",0,{"$f":"IF(torlesztes=\"Egyedi\",-SUMIFS(U$7:U$126,T$7:T$126,\">\"&AJ13,T$7:T$126,\"<=\"&AJ14),IFERROR(IF(torlesztes=\"Egyenlő tőke\",IF(COUNT($AN$7:AN14)>$D$15,\"\",-$AK$5/$D$15),0),\"\"))","v":0},"",null,"","",""]
[null,"Fedezettség",null,{"$f":"COUNT(AI7:AI126)","v":0},null,"Adott beruházási költséghez kapcsolódó teljes támogatás összege (EUR)",{"$f":"I4+IF(C34=\"Egyéb támogatások: pl. Egyéb GBER, ABER\",SUM(C44:C49)+C59,IF(C34=\"GBER 14, 17-es jogcímek\",SUM(C44:C49)+C52+C54,SUM(C44:C49)))","v":0},null,null,true,null,null,null,"",0,0,0,"",null,null,null,"",0,"","","","00:00:00",0,0,0,0,"",null,9,"","",0,{"$f":"IF(torlesztes=\"Egyedi\",-SUMIFS(U$7:U$126,T$7:T$126,\">\"&AJ14,T$7:T$126,\"<=\"&AJ15),IFERROR(IF(torlesztes=\"Egyenlő tőke\",IF(COUNT($AK$7:AK15)>$D$15,\"\",-$AK$5/$D$15),0),\"\"))","v":0},"",0,{"$f":"IF(torlesztes=\"Egyedi\",-SUMIFS(U$7:U$126,T$7:T$126,\">\"&AJ14,T$7:T$126,\"<=\"&AJ15),IFERROR(IF(torlesztes=\"Egyenlő tőke\",IF(COUNT($AN$7:AN15)>$D$15,\"\",-$AK$5/$D$15),0),\"\"))","v":0},"",null,"","",""]
[null,"Kockázati felár (bázispont)",{"$f":"IF(C12=\"Van\",OFFSET(Adatok!$E$4,MATCH(C14,Adatok!$E$5:$E$9,0),MATCH(C15,Adatok!$F$4:$H$4,0),),MAX(OFFSET(Adatok!$E$4,MATCH(C14,Adatok!$E$5:$E$9,0),MATCH(C15,Adatok!$F$4:$H$4,0),),400))","v":{"$error":"#N/A"}},null,null,"Teljes támogatás intenzítása",{"$f":"G15/eurelszamolhato","v":{"$error":"#DIV/0!"}},null,null,true,null,null,null,"",0,0,0,"",null,null,null,"",0,"","","","00:00:00",0,0,0,0,"",null,10,{"$f":"IF(COUNT(AJ16)=1,AI15+1,\"\")","v":""},"",0,{"$f":"IF(torlesztes=\"Egyedi\",-SUMIFS(U$7:U$126,T$7:T$126,\">\"&AJ15,T$7:T$126,\"<=\"&AJ16),IFERROR(IF(torlesztes=\"Egyenlő tőke\",IF(COUNT($AK$7:AK16)>$D$15,\"\",-$AK$5/$D$15),0),\"\"))","v":0},"",0,{"$f":"IF(torlesztes=\"Egyedi\",-SUMIFS(U$7:U$126,T$7:T$126,\">\"&AJ15,T$7:T$126,\"<=\"&AJ16),IFERROR(IF(torlesztes=\"Egyenlő tőke\",IF(COUNT($AN$7:AN16)>$D$15,\"\",-$AK$5/$D$15),0),\"\"))","v":0},"",null,"","",""]
[null,"Egyéni referencia kamatláb",{"$f":"+(C11+C16/10000)","v":{"$error":"#N/A"}},null,null,null,null,null,null,true,null,null,null,"",0,0,0,"",null,null,null,"",0,"","","","00:00:00",0,0,0,0,"",null,11,{"$f":"IF(COUNT(AJ17)=1,AI16+1,\"\")","v":""},"",0,{"$f":"IF(torlesztes=\"Egyedi\",-SUMIFS(U$7:U$126,T$7:T$126,\">\"&AJ16,T$7:T$126,\"<=\"&AJ17),IFERROR(IF(torlesztes=\"Egyenlő tőke\",IF(COUNT($AK$7:AK17)>$D$15,\"\",-$AK$5/$D$15),0),\"\"))","v":0},"",0,{"$f":"IF(torlesztes=\"Egyedi\",-SUMIFS(U$7:U$126,T$7:T$126,\">\"&AJ16,T$7:T$126,\"<=\"&AJ17),IFERROR(IF(torlesztes=\"Egyenlő tőke\",IF(COUNT($AN$7:AN17)>$D$15,\"\",-$AK$5/$D$15),0),\"\"))","v":0},"",null,"","",""]
[null,null,null,null,null,"Maximális támogatási mértékek",{"$f":"IF(G16>G20,\"Nem finanszírozható\",\"\")","v":{"$error":"#DIV/0!"}},{"$f":"IF(G16>H20,\"Nem finanszírozható\",\"\")","v":{"$error":"#DIV/0!"}},null,true,null,null,null,"",0,0,0,"",null,null,null,"",0,"","","","00:00:00",0,0,0,0,"",null,12,"","",0,{"$f":"IF(torlesztes=\"Egyedi\",-SUMIFS(U$7:U$126,T$7:T$126,\">\"&AJ17,T$7:T$126,\"<=\"&AJ18),IFERROR(IF(torlesztes=\"Egyenlő tőke\",IF(COUNT($AK$7:AK18)>$D$15,\"\",-$AK$5/$D$15),0),\"\"))","v":0},"",0,{"$f":"IF(torlesztes=\"Egyedi\",-SUMIFS(U$7:U$126,T$7:T$126,\">\"&AJ17,T$7:T$126,\"<=\"&AJ18),IFERROR(IF(torlesztes=\"Egyenlő tőke\",IF(COUNT($AN$7:AN18)>$D$15,\"\",-$AK$5/$D$15),0),\"\"))","v":0},"",null,"","",""]
[null,"HITELKARAKTERISZTIKA",null,{"$f":"VLOOKUP($C$31,Adatok!P3:Q5,2,0)","v":{"$error":"#N/A"}},null,null,"14-es cikk","17-es cikk",null,true,null,null,null,"",0,0,0,"",null,null,null,"",0,"","","","00:00:00",0,0,0,0,"",null,13,"","",0,{"$f":"IF(torlesztes=\"Egyedi\",-SUMIFS(U$7:U$126,T$7:T$126,\">\"&AJ18,T$7:T$126,\"<=\"&AJ19),IFERROR(IF(torlesztes=\"Egyenlő tőke\",IF(COUNT($AK$7:AK19)>$D$15,\"\",-$AK$5/$D$15),0),\"\"))","v":0},"",0,{"$f":"IF(torlesztes=\"Egyedi\",-SUMIFS(U$7:U$126,T$7:T$126,\">\"&AJ18,T$7:T$126,\"<=\"&AJ19),IFERROR(IF(torlesztes=\"Egyenlő tőke\",IF(COUNT($AN$7:AN19)>$D$15,\"\",-$AK$5/$D$15),0),\"\"))","v":0},"",null,"","",""]
[null,"Hitel fajtája/célja",null,null,null,"Maximális támogatásintenzitás (%)",{"$f":"IF(tizennegyeskizarok=0,\"Nem jogosult\",IF(ttmax14es=0,0,(G22+C52+C47)/(forintelszamolhato/arfolyam)))","v":{"$error":"#N/A"}},{"$f":"IF(tizenheteskizarok=0,\"Nem jogosult\",IF(ttmax17es=0,0,(H22+C54+C47)/(eurelszamolhato)))","v":{"$error":"#DIV/0!"}},null,true,null,null,null,"",0,0,0,"",null,null,null,"",0,"","","","00:00:00",0,0,0,0,"",null,14,"","",0,{"$f":"IF(torlesztes=\"Egyedi\",-SUMIFS(U$7:U$126,T$7:T$126,\">\"&AJ19,T$7:T$126,\"<=\"&AJ20),IFERROR(IF(torlesztes=\"Egyenlő tőke\",IF(COUNT($AK$7:AK20)>$D$15,\"\",-$AK$5/$D$15),0),\"\"))","v":0},"",0,{"$f":"IF(torlesztes=\"Egyedi\",-SUMIFS(U$7:U$126,T$7:T$126,\">\"&AJ19,T$7:T$126,\"<=\"&AJ20),IFERROR(IF(torlesztes=\"Egyenlő tőke\",IF(COUNT($AN$7:AN20)>$D$15,\"\",-$AK$5/$D$15),0),\"\"))","v":0},"",null,"","",""]
{"$rows_left_out":107}
{"sheet":"Szamitasok","index":2,"n_rows":25,"n_cols":9,"rows_kept":25,"cut":false,"hidden":true,"merged":[[19,0,19,9],[17,0,17,9],[21,0,21,9],[0,0,0,9],[2,0,2,1],[6,0,6,9],[7,0,7,9]]}
["Kizárók és KO-k"]
[null,null,null,"Váll. Méret","Mezőgazdasági","Halászat/akvakultúra",null,null,"Régió"]
["Szorzó értéke",null,null,{"$f":"Tamogatastartalom!C21","v":0},null,null,null,null,{"$f":"Tamogatastartalom!C36","v":0}]
[{"$f":"PRODUCT(C4:W4)","v":1},"általános",null,null,null,null,null,1]
[{"$f":"PRODUCT(E5:F5)","v":0},"mezőgazdasági",null,null,{"$f":"IF(Tamogatastartalom!C22=\"Mezőgazdasági\",1,0)","v":0},null,null,{"$f":"PRODUCT(I5)","v":1},{"$f":"IF(I3=\"Budapest\",0,1)","v":1}]
[{"$f":"PRODUCT(E6:F6)","v":0},"halászati",null,null,null,{"$f":"IF(Tamogatastartalom!C22=\"Halászati\",1,0)","v":0},null,1]
["14-es cikk"]
["R szorzó értéke"]
["Elszámolható ktg-ek EUR-ban",{"$f":"Tamogatastartalom!C23/IF(Tamogatastartalom!C9<>\"EUR\",arfolyam,1)","v":{"$error":"#DIV/0!"}}]
["A Elszámolható költségek",{"$f":"IF((B9-C10)>0,C10,B9)","v":{"$error":"#DIV/0!"}},50000000]
["B Elszámolható költségek",{"$f":"IF(B10<C10,0,IF(B9-C11<0,B9-C10,C10))","v":{"$error":"#DIV/0!"}},100000000]
["C elszámolható költségek","nincs!"]
["KKV bónusz",{"$f":"IF(D3=\"Mikró/Kis\",0.2,IF(D3=\"Közepes\",0.1,0))*IF(B9<50*10^6,1,0)","v":{"$error":"#DIV/0!"}}]
["Kaphat?",{"$f":"IF(B15>0,1,0)","v":{"$error":"#N/A"}}]
["Alap intenzitás",{"$f":"VLOOKUP(Tamogatastartalom!C36,Adatok!A12:B20,2,FALSE)","v":{"$error":"#N/A"}}]
["R szorzó értéke a támogatási térkép alapján",{"$f":"(B15+B13)*B14","v":{"$error":"#N/A"}}]
["Max. TT (EUR)",{"$f":"VLOOKUP(B15,Adatok!D12:E17,2,FALSE)*10^6","v":{"$error":"#N/A"}}]
["17-es cikk"]
["Vállalatméret-szorzó",{"$f":"IF(D3=\"Nagy\",0,IF(D3=\"Mikró/Kis\",0.2,0.1))","v":0.1}]
["HUF érték"]
{"$rows_left_out":6}
{"sheet":"Adatok","index":3,"n_rows":20,"n_cols":21,"rows_kept":20,"cut":false,"hidden":true,"merged":[[9,0,9,11],[0,12,0,22],[4,3,8,3],[1,3,1,7],[2,5,2,7],[0,0,0,11],[1,9,1,11]]}
["Felárak",null,null,null,null,null,null,null,null,null,null,null,"Segédszámítások"]
[null,null,null,"Piaci referencia",null,null,null,null,null,"Refin kamatok",null,null,"Törlesztés",null,null,"Törlesztésgyakoriság",null,null,"Select",null,"Select"]
[null,null,null,null,null,"Fedezettség",null,null,null,null,null,null,"Egyenlő összeg",1,null,"Havi",12,null,"Beruházási hitel",null,"Beruházási hitel"]
[null,null,null,null,null,"Magas","Általános","Alacsony",null,"Min 1",{"$f":"refkam-3.5%","v":-3.5000000000000003E-2},null,"Egyenlő tőke",2,null,"Negyedéves",4,null,"Forgóeszközhitel",null,"Lízing"]
[null,null,null,"Hitelminősítés","Kiváló",60,75,100,null,"Min2",1E-3,null,"Egyedi",0,null,"Féléves",2,null,"Lízing"]
[null,null,null,null,"Jó",75,100,220,null,"Tényleges min",{"$f":"MAX(K4:K5)","v":1E-3}]
[null,null,null,null,"Kielégítő",100,220,400,null,"Max",{"$f":"refkammin+4%","v":4.1000000000000002E-2},null,"Annuitás"]
[null,null,null,null,"Gyenge",220,400,650]
[null,null,null,null,"Rossz",400,650,1000]
["Regionális támogatási intenzitások"]
[null,"Nagyvállalat",null,"Intenzitás","MAX Támogatástartalom (mio EUR)"]
["Select",0,null,0.5,37.5]
["Dél-Alföld",0.5,null,0.35,26.25,null,null,null,"ügyleti kamat"]
["Dél-Dunántúl",0.5,null,0.3,22.5,null,null,null,"min",0]
["Észak-Alföld",0.5,null,0.25,18.75,null,null,null,"max",{"$f":"IF(Tamogatastartalom!C9=\"HUF\",0.055,0.006)","v":6.0000000000000001E-3}]
["Észak-Magyarország",0.5,null,0.2,15]
["Közép-Dunántúl",0.3,null,0,0,null,null,null,null," "]
["Pest",0.5]
["Nyugat-Dunántúl",0.3]
["Budapest",0]